Furan, 2-(1-pentenyl)-, (E)-

Van Den Dool and Kratz RI, non-polar column, custom temperature program

View large format table.

Column type Active phase I Reference Comment
CapillaryDB-5MS1000.Turchini, Giani, et al., 200430. m/0.25 mm/0.25 μm, He; Program: 35C => 120C/min => 60C1.5C/min => 100C => 5C/min => 280C

References

Turchini, Giani, et al., 2004
Turchini, G.M.; Giani, I.; Caprino, F.; Moretti, V.M.; Valfrè, F., Discrimination of origin of farmed trout by means of biometrical parameters, fillet composition and flavor volatile compounds, Ital. J. Anim. Sci., 2004, 3, 123-140. [all data]