Heptadecane, 7-methyl-

Normal alkane RI, non-polar column, temperature ramp

Data compiled by: NIST Mass Spectrometry Data Center, William E. Wallace, director

Column type CapillaryCapillary
Active phase OV-1DB-5
Column length (m) 100.30.
Carrier gas Helium
Substrate
Column diameter (mm) 0.320.25
Phase thickness (μm) 0.250.25
Tstart (C) 30.60.
Tend (C) 310.305.
Heat rate (K/min) 5.3.
Initial hold (min)  2.
Final hold (min) 5.50.
I 1746.91745.
ReferenceKrkosova, Kubinec, et al., 2007Köster, Volkman, et al., 1999
Comment MSDC-RI MSDC-RI

References

Krkosova, Kubinec, et al., 2007
Krkosova, Z.; Kubinec, R.; Addova, G.; Jurdakova, H.; Blasko, J.; Ostrovsky, I.; Sojak, L., Gas chromatographic - mass spectrometric characterization of monomethylalkanes from fuel diesel, Petroleum Coal, 2007, 49, 3, 51-62. [all data]

Köster, Volkman, et al., 1999
Köster, J.; Volkman, J.K.; Rullkötter, J.; Scholz-Böttcher, B.M.; Rethmeier, J.; Fishcer, U., Mono-, di- and trimethyl-branched alkanes in cultures of the filamentous cyanobacterium Calothrix scopulorum, Org. Geochem., 1999, 30, 11, 1367-1379, https://doi.org/10.1016/S0146-6380(99)00110-2 . [all data]