Oxirane, 2,2'-[methylenebis(4,1-phenyleneoxymethylene)]bis-
- Formula: C19H20O4
- Molecular weight: 312.3597
- IUPAC Standard InChIKey: XUCHXOAWJMEFLF-UHFFFAOYSA-N
- CAS Registry Number: 2095-03-6
- Chemical structure:

Normal alkane RI, non-polar column, temperature ramp

Column type | Active phase | I | Reference | Comment |
---|---|---|---|---|
Capillary | Methyl Silicone | 2704. | Tóth and Garay, 1994 | 10. m/0.32 mm/0.1 μm, He, 60. C @ 1. min, 12. K/min, 380. C @ 15. min |

References

Tóth and Garay, 1994
Tóth, T.; Garay, F.,
Separation of novolac resin oligomers and related industrial materials by high temperature capillary gas chromatography,
J. Hi. Res. Chromatogr., 1994, 17, 3, 177-179, https://doi.org/10.1002/jhrc.1240170312
. [all data]