N-Acetylcysteamine

Normal alkane RI, polar column, custom temperature program

View large format table.

Column type Active phase I Reference Comment
CapillaryFFAP2200.Bel Rhild, Fleury, et al., 200230. m/0.32 mm/0.25 μm, Helium; Program: 50 0C (2 min) 6 0C/min -> 180 0C 10 0C/min -> 180 0C (10 min)

References

Bel Rhild, Fleury, et al., 2002
Bel Rhild, R.; Fleury, Y.; Devaud, S.; Fay, L.B.; Blank, I.; Juillerat, M.A., Biogeneration of roasted noted based on 2-acetyl-2-thiazoline and the precursor 2-(1-hydroxyethyl)-4,5-dihydrothiazole, 2002, retrieved from http://www.imrablank.ch/ACS2002826179.pdf. [all data]