2,7-Disilaoct-4-yne, 2,2,7,7-tetramethyl-3,3,6,6-tetrakis(trimethylsilyl)-

Gas phase ion energetics data

Data compiled by: Sharon G. Lias, Rhoda D. Levin, and Sherif A. Kafafi

Ionization energy determinations

IE (eV) Method Reference Comment
7.60PEKaim and Bock, 1979Vertical value

References

Kaim and Bock, 1979
Kaim, W.; Bock, H., Radical ions XVII. Radical ions of tetrakis(trimethylsilyl)butatriene, J. Organomet. Chem., 1979, 164, 281. [all data]