4,7-Diphenyl-3a,4,7,7a-tetrahydroisobenzofuran-1,3-dione

Condensed phase thermochemistry data

Data compiled by: Hussein Y. Afeefy, Joel F. Liebman, and Stephen E. Stein

Quantity Value Units Method Reference Comment
Δcsolid-9759.6 ± 4.2kJ/molCcbMiroshnichenko, Zadontsev, et al., 1969Corresponding Δfsolid = -397. kJ/mol (simple calculation by NIST; no Washburn corrections)

References

Miroshnichenko, Zadontsev, et al., 1969
Miroshnichenko, E.A.; Zadontsev, B.G.; Lebedev, Yu.A.; Cherkashin, M.I.; Berlin, A.A., Thermochemical investigations of copolymers and block copolymers containing polyvinylene blocks in their structure, Izv. Akad. Nauk Kaz. SSSR, Ser. Khim., 1969, 1396-1399. [all data]