9-Hexadecenoic acid

Normal alkane RI, polar column, temperature ramp

Data compiled by: NIST Mass Spectrometry Data Center, William E. Wallace, director

Column type CapillaryCapillary
Active phase TC-FFAPDB-Wax
Column length (m) 60.60.
Carrier gas HeH2
Substrate
Column diameter (mm) 0.250.32
Phase thickness (μm) 0.40.25
Tstart (C) 60.40.
Tend (C) 220.230.
Heat rate (K/min) 3.4.
Initial hold (min)  5.
Final hold (min) 30.25.
I 2950.2957.
ReferenceKurose and Yatagai, 2005Dregus and Engel, 2003
Comment MSDC-RI MSDC-RI

References

Kurose and Yatagai, 2005
Kurose, K.; Yatagai, M., Components of the essential oils of Azadirachta indica A. Juss, Azadirachta siamensis Velton, and Azadirachta excelsa (Jack) Jacobs and their comparison, J. Wood Sci., 2005, 51, 2, 185-188, https://doi.org/10.1007/s10086-004-0640-4 . [all data]

Dregus and Engel, 2003
Dregus, M.; Engel, K.-H., Volatile constituents of uncooked Rhubarb (Rheum rhabarbarum L.) stalks, J. Agric. Food Chem., 2003, 51, 22, 6530-6536, https://doi.org/10.1021/jf030399l . [all data]