Chloro(diethoxy)borane

Phase change data

Data compiled by: William E. Acree, Jr., James S. Chickos

Quantity Value Units Method Reference Comment
Δvap38.9 ± 0.8kJ/molN/AWiberg and S«65533»tterlin, 1931See also Cox and Pilcher, 1970.

Gas phase ion energetics data

Data compiled by: Henry M. Rosenstock, Keith Draxl, Bruce W. Steiner, and John T. Herron

Ionization energy determinations

IE (eV) Method Reference
10.52EILappert, Litzow, et al., 1970

References

Wiberg and S«65533»tterlin, 1931
Wiberg, Egon; S«65533»tterlin, Walther, Zur Kenntnis einiger Verbindungen vom Typus BCl3-n(OR)n. («65533»ber alkoxyl-substituierte Borchloride), Z. Anorg. Allg. Chem., 1931, 202, 1, 1-21, https://doi.org/10.1002/zaac.19312020102 . [all data]

Cox and Pilcher, 1970
Cox, J.D.; Pilcher, G., Thermochemistry of Organic and Organometallic Compounds, Academic Press Inc., London, 1970, 643. [all data]

Lappert, Litzow, et al., 1970
Lappert, M.F.; Litzow, M.R.; Pedley, J.B.; Riley, P.N.K.; Spalding, T.R.; Tweedale, A., Bonding studies of compounds of boron and the group IV elements. Part III.First ionisation potentials of some simple boron compounds by electron impact and by a new empirical molecular orbital method, J. Chem. Soc. A, 1970, 2320. [all data]