Octane, 4,5-dipropyl-

Phase change data

Data compiled by: Thermodynamics Research Center, NIST Boulder Laboratories, Chris Muzny director

Quantity Value Units Method Reference Comment
Tboil493.KN/APiccard and Brewster, 1921Uncertainty assigned by TRC = 2. K

In addition to the Thermodynamics Research Center (TRC) data available from this site, much more physical and chemical property data is available from the following TRC products:

Kovats' RI, non-polar column, isothermal

View large format table.

Column type Active phase Temperature (C) I Reference Comment
CapillaryApiezon L100.1226.Rappoport and Gäumann, 1973

References

Piccard and Brewster, 1921
Piccard, J.; Brewster, R.Q., Tetrapropyl-ethane, J. Am. Chem. Soc., 1921, 43, 2626-9. [all data]

Rappoport and Gäumann, 1973
Rappoport, S.; Gäumann, T., 114. L'indice de rétention des alcanes isomères en chromatographie en phase gazeuse, Helv. Chim. Acta, 1973, 56, 3, 1145-1158, https://doi.org/10.1002/hlca.19730560338 . [all data]