Cyclohexane, 1,2,4,5-tetramethyl

Kovats' RI, non-polar column, isothermal

Data compiled by: NIST Mass Spectrometry Data Center, William E. Wallace, director

Column type PackedPackedPackedPacked
Active phase SE-30SE-30Methyl SiliconeMethyl Silicone
Column length (m)
Carrier gas N2N2
Substrate
Column diameter (mm)
Phase thickness (μm)
Temperature (C) 130.130.130.130.
I 1036.1054.1036.1054.
ReferenceMitra and Saha, 1970Mitra and Saha, 1970Antheaume and Guiochon, 1965Antheaume and Guiochon, 1965
Comment MSDC-RI MSDC-RI MSDC-RI MSDC-RI

References

Mitra and Saha, 1970
Mitra, G.D.; Saha, N.C., Determination of Retention Indices of Saturated Hydrocarbons by Graphical Methods, J. Chromatogr. Sci., 1970, 8, 2, 95-102, https://doi.org/10.1093/chromsci/8.2.95 . [all data]

Antheaume and Guiochon, 1965
Antheaume, J.; Guiochon, G., Application de la chromatographie en phase gazeuse à l'étude de la composition des fractions moyennes d'un brut pétrolier, Bull. Soc. Chim. Fr., 1965, 2, 298-307. [all data]