Plutonium monofluoride

Gas phase ion energetics data

Data compiled by: Henry M. Rosenstock, Keith Draxl, Bruce W. Steiner, and John T. Herron

Ionization energy determinations

IE (eV) Method Reference
5.9 ± 0.5EIKent, 1968

References

Kent, 1968
Kent, R.A., Mass spectrometric studies of plutonium compounds at high temperatures. II. The enthalpy of sublimation of plutonium(III) fluoride and the dissociation energy of plutonium(I) fluoride, J. Am. Chem. Soc., 1968, 90, 5657. [all data]