3,4-Methylenedioxybenzyl chloride

Kovats' RI, non-polar column, temperature ramp

Data compiled by: NIST Mass Spectrometry Data Center, William E. Wallace, director

Column type CapillaryCapillary
Active phase HP-1HP-1
Column length (m) 12.12.
Carrier gas HeHe
Substrate
Column diameter (mm) 0.200.20
Phase thickness (μm) 0.330.33
Tstart (C) 100.100.
Tend (C) 310.310.
Heat rate (K/min) 30.30.
Initial hold (min) 3.3.
Final hold (min) 8.8.
I 1300.1300.
ReferenceStaack and Maurer, 2004Staack and Maurer, 2004, 2
Comment MSDC-RI MSDC-RI

References

Staack and Maurer, 2004
Staack, R.F.; Maurer, H.H., New designer drug 1-(3,4-methylenedioxybenzyl) piperazine (MDBP): studies on its metabolism and toxicological detection in rat urine using gas chromatography/mass spectrometry, J. Mass Spectrom., 2004, 39, 3, 255-261, https://doi.org/10.1002/jms.556 . [all data]

Staack and Maurer, 2004, 2
Staack, R.F.; Maurer, H.H., Studies on the metabolism and the toxicological analysis of the nootropic drug fipexide in rat urine using gas chromatography-mass spectrometry, J. Chromatogr. B, 2004, 804, 2, 337-343, https://doi.org/10.1016/j.jchromb.2004.01.035 . [all data]