1-Methyl-2-piperidinemethanol

Phase change data

Data compiled as indicated in comments:
BS - Robert L. Brown and Stephen E. Stein
AC - William E. Acree, Jr., James S. Chickos

Quantity Value Units Method Reference Comment
Δvap16.3 ± 0.2kcal/molCRibeiro da Silva and Cabral, 2006AC

Reduced pressure boiling point

Tboil (K) Pressure (atm) Reference Comment
352.70.009Aldrich Chemical Company Inc., 1990BS

References

Ribeiro da Silva and Cabral, 2006
Ribeiro da Silva, Manuel A.V.; Cabral, Joana I.T.A., Standard molar enthalpies of formation of 1-methyl-2-piperidinemethanol, 1-piperidineethanol, and 2-piperidineethanol, The Journal of Chemical Thermodynamics, 2006, 38, 11, 1461-1466, https://doi.org/10.1016/j.jct.2006.01.005 . [all data]

Aldrich Chemical Company Inc., 1990
Aldrich Chemical Company Inc., Catalog Handbook of Fine Chemicals, Aldrich Chemical Company, Inc., Milwaukee WI, 1990, 1. [all data]