Bis(isobutyl)beryllium

Gas phase ion energetics data

Data compiled by: Henry M. Rosenstock, Keith Draxl, Bruce W. Steiner, and John T. Herron

Ionization energy determinations

IE (eV) Method Reference
8.74 ± 0.05EIChambers, Coates, et al., 1969

Appearance energy determinations

Ion AE (eV) Other Products MethodReferenceComment
C4H8Be+9.14 ± 0.03C4H10EIChambers, Coates, et al., 1969
C4H9Be+10.00 ± 0.05C4H9EIChambers, Coates, et al., 1969

References

Chambers, Coates, et al., 1969
Chambers, D.B.; Coates, G.E.; Glockling, F., Electron impact studies on organo-beryllium and -aluminium compounds, Faraday Discuss. Chem. Soc., 1969, 47, 157. [all data]