4,22-Stigmastadiene-3-one

Normal alkane RI, non-polar column, temperature ramp

Data compiled by: NIST Mass Spectrometry Data Center, William E. Wallace, director

Column type Capillary
Active phase DB-5 MS
Column length (m) 30.
Carrier gas Helium
Substrate
Column diameter (mm) 0.25
Phase thickness (μm) 0.25
Tstart (C) 70.
Tend (C) 315.
Heat rate (K/min) 5.
Initial hold (min)
Final hold (min) 10.
I 3399.
ReferenceRadulovic and Dordevic, 2011
Comment MSDC-RI

References

Radulovic and Dordevic, 2011
Radulovic, N.S.; Dordevic, N.D., Sterods from poison hemlock (Conium maculatum L.): a GC-MS analysis, J. Serb. Chem. Soc., 2011, 76, 11, 1471-1483, https://doi.org/10.2298/JSC110206128R . [all data]