C6H9

Reaction thermochemistry data

Data compiled by: John E. Bartmess

Individual Reactions

C6H8- + Hydrogen cation = C6H9

By formula: C6H8- + H+ = C6H9

Quantity Value Units Method Reference Comment
Δr388.3 ± 4.1kcal/molG+TSClifford, Wenthold, et al., 1998gas phase
Quantity Value Units Method Reference Comment
Δr381.0 ± 4.0kcal/molIMRBClifford, Wenthold, et al., 1998gas phase

References

Clifford, Wenthold, et al., 1998
Clifford, E.P.; Wenthold, P.G.; Lineberger, W.C.; Ellison, G.B.; Wang, C.X.; Grabowski, J.J.; Vila, F.; Jordan, Properties of Tetramethyleneethane (TME) as Revealed by Ion Chemistry and Ion Photoelectron Spectroscopy, J. Chem. Soc. Perkin Trans., 1998, 2, 5, 1015, https://doi.org/10.1039/a707322d . [all data]