Bromobullvalene

Phase change data

Data compiled by: William E. Acree, Jr., James S. Chickos

Enthalpy of fusion

ΔfusH (kJ/mol) Temperature (K) Method Reference
14.2317.2DSCLuz, Olivier, et al., 1998

References

Luz, Olivier, et al., 1998
Luz, Z.; Olivier, L.; Poupko, R.; Müller, K.; Krieger, C.; Zimmermann, H., Bond Shift Rearrangement of Chloro-, Bromo-, and Iodobullvalene in the Solid State and in Solution. A Carbon-13 and Proton NMR Study, J. Am. Chem. Soc., 1998, 120, 22, 5526-5538, https://doi.org/10.1021/ja9728029 . [all data]