Phthalic acid, 2TMS derivative

Van Den Dool and Kratz RI, non-polar column, temperature ramp

Data compiled by: NIST Mass Spectrometry Data Center, William E. Wallace, director

Column type CapillaryCapillaryPacked
Active phase OV-1SE-52OV-1
Column length (m) 10.25.2.
Carrier gas HeHeN2
Substrate   Supelcoport
Column diameter (mm) 0.220.32
Phase thickness (μm) 0.170.52
Tstart (C) 70.70.80.
Tend (C) 270.270.240.
Heat rate (K/min) 5.5.4.
Initial hold (min)
Final hold (min)
I 1675.1708.1675.
ReferenceLefevere, Verhaeghe, et al., 1989Lefevere, Verhaeghe, et al., 1989Mattsson and Petersson, 1977
Comment MSDC-RI MSDC-RI MSDC-RI

References

Lefevere, Verhaeghe, et al., 1989
Lefevere, M.F.; Verhaeghe, B.J.; Declerck, D.H.; Van Bocxlaer, J.F.; De Leenheer, A.P.; De Sagher, R.M., Metabolic Profiling of Urinary Organic Acids by Single and Multicolumn Capillary Gas Chromatography, J. Chromatogr. Sci., 1989, 27, 1, 23-29, https://doi.org/10.1093/chromsci/27.1.23 . [all data]

Mattsson and Petersson, 1977
Mattsson, M.; Petersson, G., Reference GLC Data for the Analysis of Phenolic Compounds as Trimethylsilyl Derivatives, J. Chromatogr. Sci., 1977, 15, 12, 546-554, https://doi.org/10.1093/chromsci/15.12.546 . [all data]