Cinnamic acid, TMS derivative

Van Den Dool and Kratz RI, non-polar column, temperature ramp

View large format table.

Column type Active phase I Reference Comment
CapillaryPE-51540.Isidorov and Vinogorova, 2003He, 5. K/min; Column length: 30. m; Column diameter: 0.25 mm; Tstart: 50. C; Tend: 250. C
PackedOV-11522.Mattsson and Petersson, 1977N2, Supelcoport, 4. K/min; Column length: 2. m; Tstart: 80. C; Tend: 240. C
PackedOV-11524.Butts, 1972He, Chromosorb W HP (80-100 mesh), 10. K/min; Column length: 2. m; Tstart: 100. C; Tend: 325. C

Van Den Dool and Kratz RI, non-polar column, custom temperature program

View large format table.

Column type Active phase I Reference Comment
CapillaryDB-11526.Tsai, Oliphant, et al., 1985He; Program: not specified

Normal alkane RI, non-polar column, custom temperature program

View large format table.

Column type Active phase I Reference Comment
CapillaryOV-1, SE-30, Methyl silicone, SP-2100, OV-101, DB-1, etc.1497.Waggott and Davies, 1984Hydrogen; Column length: 50. m; Column diameter: 0.32 mm; Program: not specified

References

Isidorov and Vinogorova, 2003
Isidorov, V.A.; Vinogorova, V.T., GC-MS analysis of compounds extracted from buds of Populus balsamifera and Populus nigra, Z. Naturforsch. C:, 2003, 58, 355-360. [all data]

Mattsson and Petersson, 1977
Mattsson, M.; Petersson, G., Reference GLC Data for the Analysis of Phenolic Compounds as Trimethylsilyl Derivatives, J. Chromatogr. Sci., 1977, 15, 12, 546-554, https://doi.org/10.1093/chromsci/15.12.546 . [all data]

Butts, 1972
Butts, W.C., Two-Column Gas Chromatography of Trimethylsilyl Derivatives of Biochemically Significant Compounds, Anal. Biochemistry, 1972, 46, 1, 187-199, https://doi.org/10.1016/0003-2697(72)90411-3 . [all data]

Tsai, Oliphant, et al., 1985
Tsai, M.Y.; Oliphant, C.; Josephson, M.W., Identification of Metabolites Diagnostic for Organic Acidurias by Simultaneous Dual-Column Capillary Gas Chromatography, J. Chromatogr., 1985, 341, 1-10, https://doi.org/10.1016/S0378-4347(00)84004-9 . [all data]

Waggott and Davies, 1984
Waggott, A.; Davies, I.W., Identification of organic pollutants using linear temperature programmed retention indices (LTPRIs) - Part II, 1984, retrieved from http://dwi.defra.gov.uk/research/completed-research/reports/dwi0383.pdf. [all data]