Dihydrocarvyl acetate

Van Den Dool and Kratz RI, non-polar column, temperature ramp

Data compiled by: NIST Mass Spectrometry Data Center, William E. Wallace, director

Column type CapillaryCapillaryCapillaryCapillary
Active phase DB-5HP-5MSBP-1Methyl Silicone
Column length (m) 30.30.50.50.
Carrier gas HeHe N2
Substrate
Column diameter (mm) 0.250.250.220.25
Phase thickness (μm) 0.250.250.250.17
Tstart (C) 60.60.60.80.
Tend (C) 240.280.220.200.
Heat rate (K/min) 3.4.2.2.
Initial hold (min)  5.
Final hold (min)   20.
I 1344.1304.1307.1323.
ReferenceFlamini, Luigi Cioni, et al., 2003Skaltsa, Mavrommati, et al., 2001Baldovini, Ristorcelli, et al., 2000Sumathykutty, Rao, et al., 1999
Comment MSDC-RI MSDC-RI MSDC-RI MSDC-RI

Kovats' RI, polar column, isothermal

Data compiled by: NIST Mass Spectrometry Data Center, William E. Wallace, director

Column type Packed
Active phase Carbowax 20M
Column length (m) 2.5
Carrier gas N2
Substrate Embacel
Column diameter (mm)
Phase thickness (μm)
Temperature (C) 150.
I 1700.
Referenceter Heide, 1968
Comment MSDC-RI

References

Flamini, Luigi Cioni, et al., 2003
Flamini, G.; Luigi Cioni, P.; Morelli, I., Volatiles from leaves, fruits, and virgin oil from Olea europaea Cv. Olivastra Seggianese from Italy, J. Agric. Food Chem., 2003, 51, 5, 1382-1386, https://doi.org/10.1021/jf020854y . [all data]

Skaltsa, Mavrommati, et al., 2001
Skaltsa, H.D.; Mavrommati, A.; Constantinidis, T., A chemotaxonomic investigation of volatile constituents in Stachys subsect. Swainsonianeae (Labiatae), Phytochemistry, 2001, 57, 2, 235-244, https://doi.org/10.1016/S0031-9422(01)00003-6 . [all data]

Baldovini, Ristorcelli, et al., 2000
Baldovini, N.; Ristorcelli, D.; Tomi, F.; Casanova, J., Infraspecific variability of the essential oil of Calamintha nepeta from Corsica (France), Flavour Fragr. J., 2000, 15, 1, 50-54, https://doi.org/10.1002/(SICI)1099-1026(200001/02)15:1<50::AID-FFJ871>3.0.CO;2-F . [all data]

Sumathykutty, Rao, et al., 1999
Sumathykutty, M.A.; Rao, J.M.; Padmakumari, K.P.; Narayanan, C.S., Essential oil constituents of some Piper species, Flavour Fragr. J., 1999, 14, 5, 279-282, https://doi.org/10.1002/(SICI)1099-1026(199909/10)14:5<279::AID-FFJ821>3.0.CO;2-0 . [all data]