Cyclohexanol, 5-methyl-2-(1-methylethyl)-, acetate, (1α,2β,5β)-

Kovats' RI, non-polar column, temperature ramp

Data compiled by: NIST Mass Spectrometry Data Center, William E. Wallace, director

Column type Capillary
Active phase OV-101
Column length (m) 25.
Carrier gas N2
Substrate
Column diameter (mm) 0.25
Phase thickness (μm) 0.25
Tstart (C) 50.
Tend (C) 200.
Heat rate (K/min) 5.
Initial hold (min)
Final hold (min)
I 1282.
Referencevon Poser, Menut, et al., 1996
Comment MSDC-RI

Kovats' RI, non-polar column, isothermal

Data compiled by: NIST Mass Spectrometry Data Center, William E. Wallace, director

Column type Packed
Active phase Apiezon L
Column length (m) 2.5
Carrier gas N2
Substrate Embacel
Column diameter (mm)
Phase thickness (μm)
Temperature (C) 150.
I 1251.
Referenceter Heide, 1968
Comment MSDC-RI

References

von Poser, Menut, et al., 1996
von Poser, G.L.; Menut, C.; Toffoli, M.E.; Vérin, P.; Sobral, M.; Bessière, J.-M.; Lamaty, G.; Henriques, A.T., Essential oil composition and allelopathic effect of the Brazilian Lamiaceae Hesperozygis ringens (Benth.) Epling and Hesperozygis rhododon Epling, J. Agric. Food Chem., 1996, 44, 7, 1829-1832, https://doi.org/10.1021/jf950653c . [all data]