Benzene, 1,2,4-trichloro-3-methyl-

Gas phase ion energetics data

Data compiled by: Sharon G. Lias and Joel F. Liebman

Ionization energy determinations

IE (eV) Method Reference
8.85PEFujisawa, Oonishi, et al., 1992

References

Fujisawa, Oonishi, et al., 1992
Fujisawa, S.; Oonishi, E.; Masuda, S.; Ohno, K.; Harada, Y., Penning ionization electron spectroscopy of dichloro- and trichlorotoluenes, J. Phys. Chem., 1992, 96, 6199. [all data]