1α,2β,3α,4β,5α,6β-Hexaethylcyclohexane

Condensed phase thermochemistry data

Data compiled by: Hussein Y. Afeefy, Joel F. Liebman, and Stephen E. Stein

Quantity Value Units Method Reference Comment
Δcsolid-11587.79kJ/molCcbGollis, Belenyessy, et al., 1962Mixed isomers; Corresponding Δfsolid = -640.33 kJ/mol (simple calculation by NIST; no Washburn corrections)

References

Gollis, Belenyessy, et al., 1962
Gollis, M.H.; Belenyessy, L.I.; Gudzinowicz, B.J.; Koch, S.D.; Smith, J.O.; Wineman, R.J., Evaluation of pure hydrocarbons as jet fuels, J. Chem. Eng. Data, 1962, 7, 331-316. [all data]