Benzene,1-methoxy-4-(1-methylethoxy)-
- Formula: C10H14O2
- Molecular weight: 166.2170
- IUPAC Standard InChIKey: XINCYEXLJNFQGQ-UHFFFAOYSA-N
- CAS Registry Number: 20744-02-9
- Chemical structure:

Gas phase ion energetics data

Data compiled by: Sharon G. Lias, Rhoda D. Levin, and Sherif A. Kafafi
Ionization energy determinations
IE (eV) | Method | Reference | Comment |
---|---|---|---|
7.83 ± 0.015 | PE | Klessinger, Asmus, et al., 1975 | Vertical value |

References

Klessinger, Asmus, et al., 1975
Klessinger, M.; Asmus, P.; Kraatz, U.,
Photoelektronenspektren organischer verbindungen-VII,
Tetrahedron, 1975, 31, 517. [all data]