2,2-Dimethylheptane-3,5-dione

Gas phase thermochemistry data

Data compiled by: Hussein Y. Afeefy, Joel F. Liebman, and Stephen E. Stein

Quantity Value Units Method Reference Comment
Δfgas-470.9 ± 2.3kJ/molCcbFerrao and Ribeiro Da Silva, 1981For enol form(93.4%)

Condensed phase thermochemistry data

Data compiled by: Hussein Y. Afeefy, Joel F. Liebman, and Stephen E. Stein

Quantity Value Units Method Reference Comment
Δfliquid-527.1 ± 2.2kJ/molCcbFerrao and Ribeiro Da Silva, 1981
Δfliquid-527.8 ± 2.3kJ/molCcbFerrao and Ribeiro Da Silva, 1981For enol form(93.4%)
Quantity Value Units Method Reference Comment
Δcliquid-5301.1 ± 1.8kJ/molCcbFerrao and Ribeiro Da Silva, 1981Corresponding Δfliquid = -527.1 kJ/mol (simple calculation by NIST; no Washburn corrections)

References

Ferrao and Ribeiro Da Silva, 1981
Ferrao, M.L.C.C.H.; Ribeiro Da Silva, M.A.V., Enthalpies of combustion of four methyl-substituted heptane-3,5-diones and benzoylacetone, J. Chem. Thermodyn., 1981, 13, 567-571. [all data]