CAS Reg. No. 20733-13-5

Reaction thermochemistry data

Data compiled by: John E. Bartmess

Individual Reactions

(CAS Reg. No. 20733-13-5 • 4294967295Thioacetaldehyde) + Thioacetaldehyde = CAS Reg. No. 20733-13-5

By formula: (CAS Reg. No. 20733-13-5 • 4294967295C2H4S) + C2H4S = CAS Reg. No. 20733-13-5

Quantity Value Units Method Reference Comment
Δr286. ± 13.kJ/molN/ABartmess, Scott, et al., 1979gas phase; value altered from reference due to change in acidity scale

References

Bartmess, Scott, et al., 1979
Bartmess, J.E.; Scott, J.A.; McIver, R.T., Jr., The gas phase acidity scale from methanol to phenol, J. Am. Chem. Soc., 1979, 101, 6047. [all data]