3,6-Dimethyl-3,6-di-tert-butyl-1,2,4,5-tetraoxacyclohexane

Phase change data

Data compiled by: William E. Acree, Jr., James S. Chickos

Quantity Value Units Method Reference Comment
Δvap53.7kJ/molCGCCañizo, Eyler, et al., 2006Based on data from 403. - 473. K.

References

Cañizo, Eyler, et al., 2006
Cañizo, A.I.; Eyler, G.N.; Barreto, G.P., Determination of the Enthalpies of Vaporization of Cyclic Organic Peroxides by Correlation of Changes in Gas Chromatographic Retention Times, Chroma, 2006, 65, 1-2, 31-34, https://doi.org/10.1365/s10337-006-0094-5 . [all data]