[1,2]Dithiolo[1,5-b][1,2]dithiole-7-s(iv),2-methyl-

Gas phase ion energetics data

Data compiled by: Sharon G. Lias, Rhoda D. Levin, and Sherif A. Kafafi

Ionization energy determinations

IE (eV) Method Reference Comment
7.83PEGleiter, Hornung, et al., 1971Vertical value

References

Gleiter, Hornung, et al., 1971
Gleiter, R.; Hornung, V.; Lindberg, B.; Hogberg, S.; Lozach, N., The He-584 A X-ray photoelectron spectra of thiathiophthenes, Chem. Phys. Lett., 1971, 11, 401. [all data]