(E)-4-Phenylazophenol

Gas phase ion energetics data

Data compiled as indicated in comments:
LLK - Sharon G. Lias, Rhoda D. Levin, and Sherif A. Kafafi

Ionization energy determinations

IE (eV) Method Reference Comment
7.6PEMillefiori and Millefiori, 1981LLK
8.18PEMillefiori and Millefiori, 1981Vertical value; LLK
8.2 ± 0.05PEMillefiori, Millefiori, et al., 1979Vertical value; LLK

References

Millefiori and Millefiori, 1981
Millefiori, S.; Millefiori, A., Spectroscopic and electrochemical properties of intramolecularly hydrogen-bonded compounds. Ortho-hydroxyazobenzenes, Can. J. Chem., 1981, 59, 821. [all data]

Millefiori, Millefiori, et al., 1979
Millefiori, S.; Millefiori, A.; Pignataro, S.; Distefano, G.; Colonna, F.P., Gas phase UPS investigation of trans-azobenzenes, Z. Naturforsch. A:, 1979, 34, 1496. [all data]