Heptyl peroxy radical

Gas phase ion energetics data

Data compiled by: Henry M. Rosenstock, Keith Draxl, Bruce W. Steiner, and John T. Herron

Ionization energy determinations

IE (eV) Method Reference
8.3 ± 0.2EIBurgess, SenSharma, et al., 1968

References

Burgess, SenSharma, et al., 1968
Burgess, A.R.; SenSharma, D.K.; White, M.J.D., The mass spectrometry of some alkyl peroxy radicals and related alkyl hydroperoxides, Advan. Mass Spectrom., 1968, 4, 345. [all data]