(Z)-2-octenal

Normal alkane RI, polar column, temperature ramp

Data compiled by: NIST Mass Spectrometry Data Center, William E. Wallace, director

Column type Capillary
Active phase Carbowax 20M
Column length (m) 50.
Carrier gas
Substrate
Column diameter (mm) 0.32
Phase thickness (μm)
Tstart (C) 70.
Tend (C) 190.
Heat rate (K/min) 2.
Initial hold (min)
Final hold (min)
I 1379.
ReferenceTressl, Bahri, et al., 1982
Comment MSDC-RI

References

Tressl, Bahri, et al., 1982
Tressl, R.; Bahri, D.; Engel, K.-H., Formation of eight-carbon and ten-carbon components in mushrooms (Agaricus campestris), J. Agric. Food Chem., 1982, 30, 1, 89-93, https://doi.org/10.1021/jf00109a019 . [all data]