Oxazole, 4,5-dimethyl-

Normal alkane RI, polar column, custom temperature program

Data compiled by: NIST Mass Spectrometry Data Center, William E. Wallace, director

Column type CapillaryCapillaryCapillaryCapillaryCapillary
Active phase HP-InnowaxHP-InnowaxCarbowaxCarbowaxCarbowax
Column length (m) 60.60.
Carrier gas HeliumHelium
Substrate
Column diameter (mm) 0.320.32
Phase thickness (μm) 0.250.25
Program 40 0C (5 min) 4 0C/min -> 60 0C (5 min) 8 0C/min -> 250 0C (3 min)not specifiednot specifiednot specifiednot specified
I 1151.1152.1139.1139.1139.
ReferenceViegas and Bassoli, 2007Viegas and Bassoli, 2007Baltes and Bochmann, 1987Baltes and Bochmann, 1987Baltes and Bochmann, 1987
Comment MSDC-RI MSDC-RI MSDC-RI MSDC-RI MSDC-RI
Column type CapillaryCapillary
Active phase CarbowaxCarbowax
Column length (m)
Carrier gas
Substrate
Column diameter (mm)
Phase thickness (μm)
Program not specifiednot specified
I 1140.1141.
ReferenceBaltes and Bochmann, 1987Baltes and Bochmann, 1987
Comment MSDC-RI MSDC-RI

Van Den Dool and Kratz RI, polar column, temperature ramp

Data compiled by: NIST Mass Spectrometry Data Center, William E. Wallace, director

Column type CapillaryCapillary
Active phase CP-Wax 52CBDB-Wax
Column length (m) 50.60.
Carrier gas  He
Substrate
Column diameter (mm) 0.320.25
Phase thickness (μm)  0.25
Tstart (C) 60.50.
Tend (C) 220.230.
Heat rate (K/min) 4.2.
Initial hold (min) 5.
Final hold (min) 30.60.
I 1142.1152.
ReferenceMahadevan and Farmer, 2006Shimoda, Shiratsuchi, et al., 1996
Comment MSDC-RI MSDC-RI

References

Viegas and Bassoli, 2007
Viegas, M.C.; Bassoli, D.G., Utilizacao do indice de retencao linear para caracterizacao de compostos volateis em cafe soluvel utilizando GC-MS e coluna HP-Innowax, Quim. Nova, 2007, 30, 8, 2031-2034, https://doi.org/10.1590/S0100-40422007000800040 . [all data]

Baltes and Bochmann, 1987
Baltes, W.; Bochmann, G., Model reactions on roast aroma formations, V. Mass spectrometric identification of pyrifines, oxazoles, and carbocyclic compounds from the reaction of serine and threonine with sucrose under the conditions of coffee roasting, Z. Lebensm. Unters. Forsch., 1987, 185, 1, 5-9, https://doi.org/10.1007/BF01083331 . [all data]