Pentacyclo[3.3.0.02,4.03,7.06,8]octane

Gas phase ion energetics data

Data compiled as indicated in comments:
LLK - Sharon G. Lias, Rhoda D. Levin, and Sherif A. Kafafi

Ionization energy determinations

IE (eV) Method Reference Comment
8.18PEGassman and Yamaguchi, 1979LLK

References

Gassman and Yamaguchi, 1979
Gassman, P.G.; Yamaguchi, R., Electrochemical oxidation of strained hydrocarbons, J. Am. Chem. Soc., 1979, 101, 1308. [all data]