2,2-Dimethylpentanenitrile

Gas phase thermochemistry data

Data compiled by: Hussein Y. Afeefy, Joel F. Liebman, and Stephen E. Stein

Quantity Value Units Method Reference Comment
Δfgas-45.78 ± 0.86kJ/molCcrRakus, Verevkin, et al., 1994

Condensed phase thermochemistry data

Data compiled by: Hussein Y. Afeefy, Joel F. Liebman, and Stephen E. Stein

Quantity Value Units Method Reference Comment
Δfsolid-92.68 ± 0.75kJ/molCcrRakus, Verevkin, et al., 1994
Quantity Value Units Method Reference Comment
Δcsolid-4519.7 ± 0.69kJ/molCcrRakus, Verevkin, et al., 1994

Phase change data

Data compiled as indicated in comments:
AC - William E. Acree, Jr., James S. Chickos
ALS - Hussein Y. Afeefy, Joel F. Liebman, and Stephen E. Stein

Quantity Value Units Method Reference Comment
Δsub46.90 ± 0.42kJ/molVRakus, Verevkin, et al., 1994ALS

Enthalpy of vaporization

ΔvapH (kJ/mol) Temperature (K) Method Reference Comment
46.9 ± 0.4274. - 303.GSRakus, Verevkin, et al., 1994AC

References

Rakus, Verevkin, et al., 1994
Rakus, K.; Verevkin, S.P.; Beckhaus, H.-D.; Rchardt, C., Thermochemistry and thermal decomposition of alkyl-substituted tricyanomethyl compounds, Chem. Ber., 1994, 127, 2225-2234. [all data]