1H-Indole-2,3-dione, 1-methyl-

Phase change data

Data compiled by: William E. Acree, Jr., James S. Chickos

Quantity Value Units Method Reference Comment
Δsub25.24 ± 0.79kcal/molCMatos, Miranda, et al., 2003

Enthalpy of fusion

ΔfusH (kcal/mol) Temperature (K) Method Reference
4.66403.3DSCMatos, Miranda, et al., 2003

Normal alkane RI, non-polar column, temperature ramp

View large format table.

Column type Active phase I Reference Comment
CapillaryHP-5 MS1477.Safaei-Ghomi, Bamoniri, et al., 200730. m/0.25 mm/0.25 μm, Helium, 60. C @ 3. min, 5. K/min, 220. C @ 3. min

References

Matos, Miranda, et al., 2003
Matos, M. Agostinha R.; Miranda, Margarida S.; Morais, Victor M.F.; Liebman, Joel F., Are isatin and isatoic anhydride antiaromatic and aromatic respectively? A combined experimental and theoretical investigation, Org. Biomol. Chem., 2003, 1, 14, 2566-712, https://doi.org/10.1039/b304405j . [all data]

Safaei-Ghomi, Bamoniri, et al., 2007
Safaei-Ghomi, J.; Bamoniri, A.; Hatami, A.; Batooli, H., Composition of the Essential Oil of Stachys acerosa Growing in Central Iran, Chem. Nat. Comp., 2007, 43, 1, 37-39, https://doi.org/10.1007/s10600-007-0026-0 . [all data]