Clothiapine

Kovats' RI, non-polar column, isothermal

Data compiled by: NIST Mass Spectrometry Data Center, William E. Wallace, director

Column type PackedCapillary
Active phase SE-30SPB-1
Column length (m) 2.25.
Carrier gas N2He
Substrate 1% se-30 on Anachrom ABS(80-100mesh)
Column diameter (mm)  0.20
Phase thickness (μm)
Temperature (C) 260.250.
I 2683.2709.
ReferenceMusumarra, Scarlata, et al., 1987Lora-Tamayo, Rams, et al., 1986
Comment MSDC-RI MSDC-RI

References

Musumarra, Scarlata, et al., 1987
Musumarra, G.; Scarlata, G.; Romano, G.; Cappello, G.; Clementi, S.; Giulietti, G., Qualitative organic analysis. Part 2. Identification of drugs by principal components analysis of standardized TLC data in four eluent systems and of retention indices on SE 30, J. Anal. Toxicol., 1987, 11, 4, 154-163, https://doi.org/10.1093/jat/11.4.154 . [all data]

Lora-Tamayo, Rams, et al., 1986
Lora-Tamayo, C.; Rams, M.A.; Chacon, J.M.R., Gas Chromatographic Data for 187 Nitrogen- or Phosphorus-Containing Drugs and Metabolites of Toxicological Interest Analysed on Methyl Silicone Capillary Columns, J. Chromatogr., 1986, 374, 73-85, https://doi.org/10.1016/S0378-4347(00)83254-5 . [all data]