Propanal, 2-methyl-, (2,4-dinitrophenyl)hydrazone

Kovats' RI, non-polar column, isothermal

Data compiled by: NIST Mass Spectrometry Data Center, William E. Wallace, director

Column type Packed
Active phase OV-3
Column length (m) 1.
Carrier gas Mixture
Substrate
Column diameter (mm)
Phase thickness (μm)
Temperature (C) 205.
I 2312.
ReferencePías and Gascó, 1975
Comment MSDC-RI

References

Pías and Gascó, 1975
Pías, J.B.; Gascó, L., Gas-liquid chromatography of 2,4-dinitrophenylhydrazones of carbonyl compounds; retention indices and molecular structure, Chromatographia, 1975, 8, 6, 270-273, https://doi.org/10.1007/BF02270935 . [all data]