Pyridine, 4-(3-phenylpropyl)-

Van Den Dool and Kratz RI, non-polar column, temperature ramp

View large format table.

Column type Active phase I Reference Comment
CapillaryOV-11730.6Gautzsch and Zinn, 19968. K/min; Tstart: 35. C; Tend: 300. C

Normal alkane RI, non-polar column, isothermal

View large format table.

Column type Active phase Temperature (C) I Reference Comment
PackedSE-30220.1725.Xiaoyun, Xiammou, et al., 1991Column length: 2. m

References

Gautzsch and Zinn, 1996
Gautzsch, R.; Zinn, P., Use of incremental models to estimate the retention indexes of aromatic compounds, Chromatographia, 1996, 43, 3/4, 163-176, https://doi.org/10.1007/BF02292946 . [all data]

Xiaoyun, Xiammou, et al., 1991
Xiaoyun, J.; Xiammou, Z.; Yijian, G., Kovats retention indices of some alkylquinolines, alkylisoquinolines, phenylalkyl- and phenoxyalkylpyridines, Chin, J, Chromatogr., 1991, 9, 3, 187-191. [all data]