Tantalum cation

Reaction thermochemistry data

Data compiled by: Michael M. Meot-Ner (Mautner) and Sharon G. Lias

Individual Reactions

(Ta+ • 2tantalum) + tantalum = (Ta+ • 3tantalum)

By formula: (Ta+ • 2Ta) + Ta = (Ta+ • 3Ta)

Enthalpy of reaction

ΔrH° (kJ/mol) T (K) Method Reference Comment
743.9 CIDArmentrout and Kickel, 1994gas phase; guided ion beam CID

(Ta+ • tantalum) + tantalum = (Ta+ • 2tantalum)

By formula: (Ta+ • Ta) + Ta = (Ta+ • 2Ta)

Enthalpy of reaction

ΔrH° (kJ/mol) T (K) Method Reference Comment
643.9 CIDArmentrout and Kickel, 1994gas phase; guided ion beam CID

Ta+ + tantalum = (Ta+ • tantalum)

By formula: Ta+ + Ta = (Ta+ • Ta)

Enthalpy of reaction

ΔrH° (kJ/mol) T (K) Method Reference Comment
666.1 CIDArmentrout and Kickel, 1994gas phase; guided ion beam CID

Ion clustering data

Data compiled by: Michael M. Meot-Ner (Mautner) and Sharon G. Lias

Clustering reactions

Ta+ + tantalum = (Ta+ • tantalum)

By formula: Ta+ + Ta = (Ta+ • Ta)

Enthalpy of reaction

ΔrH° (kJ/mol) T (K) Method Reference Comment
666.1 CIDArmentrout and Kickel, 1994gas phase; guided ion beam CID

(Ta+ • tantalum) + tantalum = (Ta+ • 2tantalum)

By formula: (Ta+ • Ta) + Ta = (Ta+ • 2Ta)

Enthalpy of reaction

ΔrH° (kJ/mol) T (K) Method Reference Comment
643.9 CIDArmentrout and Kickel, 1994gas phase; guided ion beam CID

(Ta+ • 2tantalum) + tantalum = (Ta+ • 3tantalum)

By formula: (Ta+ • 2Ta) + Ta = (Ta+ • 3Ta)

Enthalpy of reaction

ΔrH° (kJ/mol) T (K) Method Reference Comment
743.9 CIDArmentrout and Kickel, 1994gas phase; guided ion beam CID

References

Armentrout and Kickel, 1994
Armentrout, P.B.; Kickel, B.L., Gas Phase Thermochemistry of Transition Metal Ligand Systems: Reassessment of Values and Periodic Trends, in Organometallic Ion Chemistry, B. S. Freiser, ed, 1994. [all data]