Rhodium, positive ion

Reaction thermochemistry data

Data compiled as indicated in comments:
M - Michael M. Meot-Ner (Mautner) and Sharon G. Lias
RCD - Robert C. Dunbar

Individual Reactions

Rh+ + Propene = (Rh+ • Propene)

By formula: Rh+ + C3H6 = (Rh+ • C3H6)

Enthalpy of reaction

ΔrH° (kJ/mol) T (K) Method Reference Comment
118. CIDChen and Armetrout, 1995gas phase; ΔrH>=, guided ion beam CID; M

Rh+ + Acetylene = (Rh+ • Acetylene)

By formula: Rh+ + C2H2 = (Rh+ • C2H2)

Enthalpy of reaction

ΔrH° (kJ/mol) T (K) Method Reference Comment
129. CIDChen and Armetrout, 1995gas phase; ΔrH>=, guided ion beam CID; M

Rh+ + Allene = (Rh+ • Allene)

By formula: Rh+ + C3H4 = (Rh+ • C3H4)

Enthalpy of reaction

ΔrH° (kJ/mol) T (K) Method Reference Comment
222. (+19.,-0.) CIDChen and Armetrout, 1995gas phase; guided ion beam CID; M

Rh+ + Ethylene = (Rh+ • Ethylene)

By formula: Rh+ + C2H4 = (Rh+ • C2H4)

Enthalpy of reaction

ΔrH° (kJ/mol) T (K) Method Reference Comment
161. (+3.,-0.) CIDChen and Armetrout, 1995gas phase; guided ion beam CID; M

Rh+ + Carbon monosulfide = (Rh+ • Carbon monosulfide)

By formula: Rh+ + CS = (Rh+ • CS)

Quantity Value Units Method Reference Comment
Δr234. ± 19.kJ/molCIDTRodgers and Armentrout, 2000RCD

References

Chen and Armetrout, 1995
Chen, Y.M.; Armetrout, P.B., Activation of C2H6, C3H8, and c-C3H6 by Gas-Phase Rh+ and the Thermochemistry of Rh-Ligand Complexes, J. Am. Chem. Soc., 1995, 117, 36, 9291, https://doi.org/10.1021/ja00141a022 . [all data]

Rodgers and Armentrout, 2000
Rodgers, M.T.; Armentrout, P.B., Noncovalent Metal-Ligand Bond Energies as Studied by Threshold Collision-Induced Dissociation, Mass Spectrom. Rev., 2000, 19, 4, 215, https://doi.org/10.1002/1098-2787(200007)19:4<215::AID-MAS2>3.0.CO;2-X . [all data]