Platinum ion (1+)

Reaction thermochemistry data

Data compiled by: Robert C. Dunbar

Individual Reactions

(Platinum ion (1+) • 2Carbon monoxide) + Carbon monoxide = (Platinum ion (1+) • 3Carbon monoxide)

By formula: (Pt+ • 2CO) + CO = (Pt+ • 3CO)

Quantity Value Units Method Reference Comment
Δr97.9 ± 5.0kJ/molCIDTZhang and Armentrout, 2001

(Platinum ion (1+) • 3Carbon monoxide) + Carbon monoxide = (Platinum ion (1+) • 4Carbon monoxide)

By formula: (Pt+ • 3CO) + CO = (Pt+ • 4CO)

Quantity Value Units Method Reference Comment
Δr53.1 ± 5.0kJ/molCIDTZhang and Armentrout, 2001

(Platinum ion (1+) • Carbon monoxide) + Carbon monoxide = (Platinum ion (1+) • 2Carbon monoxide)

By formula: (Pt+ • CO) + CO = (Pt+ • 2CO)

Quantity Value Units Method Reference Comment
Δr193. ± 10.kJ/molCIDTZhang and Armentrout, 2001

Platinum ion (1+) + Carbon monoxide = (Platinum ion (1+) • Carbon monoxide)

By formula: Pt+ + CO = (Pt+ • CO)

Quantity Value Units Method Reference Comment
Δr212. ± 10.kJ/molCIDTZhang and Armentrout, 2001

Ion clustering data

Data compiled by: Robert C. Dunbar

Clustering reactions

Platinum ion (1+) + Carbon monoxide = (Platinum ion (1+) • Carbon monoxide)

By formula: Pt+ + CO = (Pt+ • CO)

Quantity Value Units Method Reference Comment
Δr212. ± 10.kJ/molCIDTZhang and Armentrout, 2001

(Platinum ion (1+) • Carbon monoxide) + Carbon monoxide = (Platinum ion (1+) • 2Carbon monoxide)

By formula: (Pt+ • CO) + CO = (Pt+ • 2CO)

Quantity Value Units Method Reference Comment
Δr193. ± 10.kJ/molCIDTZhang and Armentrout, 2001

(Platinum ion (1+) • 2Carbon monoxide) + Carbon monoxide = (Platinum ion (1+) • 3Carbon monoxide)

By formula: (Pt+ • 2CO) + CO = (Pt+ • 3CO)

Quantity Value Units Method Reference Comment
Δr97.9 ± 5.0kJ/molCIDTZhang and Armentrout, 2001

(Platinum ion (1+) • 3Carbon monoxide) + Carbon monoxide = (Platinum ion (1+) • 4Carbon monoxide)

By formula: (Pt+ • 3CO) + CO = (Pt+ • 4CO)

Quantity Value Units Method Reference Comment
Δr53.1 ± 5.0kJ/molCIDTZhang and Armentrout, 2001

References

Zhang and Armentrout, 2001
Zhang, X.-G.; Armentrout, P.B., Sequential Bond Energies of Pt(CO)x, (x=1-4) Determined by Collision-Induced Dissociation, Organometallics, 2001, 20, 20, 4266, https://doi.org/10.1021/om010390d . [all data]