Palladium ion (1+)

Reaction thermochemistry data

Data compiled by: Robert C. Dunbar

Individual Reactions

Palladium ion (1+) + Carbon monosulfide = (Palladium ion (1+) • Carbon monosulfide)

By formula: Pd+ + CS = (Pd+ • CS)

Quantity Value Units Method Reference Comment
Δr47.8 ± 3.3kcal/molCIDTRodgers and Armentrout, 2000

References

Rodgers and Armentrout, 2000
Rodgers, M.T.; Armentrout, P.B., Noncovalent Metal-Ligand Bond Energies as Studied by Threshold Collision-Induced Dissociation, Mass Spectrom. Rev., 2000, 19, 4, 215, https://doi.org/10.1002/1098-2787(200007)19:4<215::AID-MAS2>3.0.CO;2-X . [all data]