Manganese, hydropentakis(phosphorus trifluoride)-

Gas phase ion energetics data

Data compiled by: Sharon G. Lias, Rhoda D. Levin, and Sherif A. Kafafi

Ionization energy determinations

IE (eV) Method Reference Comment
9.47PEHead, Nixon, et al., 1975Vertical value

References

Head, Nixon, et al., 1975
Head, R.A.; Nixon, J.F.; Sharp, G.J.; Clark, R.J., Photoelectron spectroscopic study of metal trifluorophosphine and hydridotrifluorophosphine complexes, J. Chem. Soc. Dalton Trans., 1975, 2054. [all data]