Dibenzo-1,3a,6,6a-tetraazapentalene

Phase change data

Data compiled by: William E. Acree, Jr., James S. Chickos

Enthalpy of sublimation

ΔsubH (kcal/mol) Temperature (K) Reference Comment
10.1 ± 0.81403.Chia and Simmons, 1967Based on data from 363. - 443. K.

References

Chia and Simmons, 1967
Chia, Y.T.; Simmons, H.E., Aromatic azapentalenes. IV. heats of combustion of monobenzo- and dibenzo-1,3a,6,6a-tetraazapentalenes and monobenzo- and dibenzo-1,3a,4,6a-tetraazapentalenes. The structure of tetraazapentalenes, J. Am. Chem. Soc., 1967, 89, 2638-2643. [all data]