4-isopropyl styrene

Phase change data

Data compiled as indicated in comments:
AC - William E. Acree, Jr., James S. Chickos

Enthalpy of vaporization

ΔvapH (kJ/mol) Temperature (K) Method Reference Comment
48.5423.AStephenson and Malanowski, 1987Based on data from 408. - 478. K.; AC

Antoine Equation Parameters

log10(P) = A − (B / (T + C))
    P = vapor pressure (bar)
    T = temperature (K)

View plot Requires a JavaScript / HTML 5 canvas capable browser.

Temperature (K) A B C Reference Comment
307.9 - 475.74.645842035.762-37.095Stull, 1947Coefficents calculated by NIST from author's data.

Kovats' RI, non-polar column, isothermal

Data compiled by: NIST Mass Spectrometry Data Center, William E. Wallace, director

Column type CapillaryCapillary
Active phase SE-30SE-30
Column length (m) 25.525.5
Carrier gas HeHe
Substrate
Column diameter (mm) 0.50.5
Phase thickness (μm)
Temperature (C) 65.65.
I 1136.51136.5
ReferenceSvob, Deur-Siftar, et al., 1974Svob and Deur-Siftar, 1974
Comment MSDC-RI MSDC-RI

References

Stephenson and Malanowski, 1987
Stephenson, Richard M.; Malanowski, Stanislaw, Handbook of the Thermodynamics of Organic Compounds, 1987, https://doi.org/10.1007/978-94-009-3173-2 . [all data]

Stull, 1947
Stull, Daniel R., Vapor Pressure of Pure Substances. Organic and Inorganic Compounds, Ind. Eng. Chem., 1947, 39, 4, 517-540, https://doi.org/10.1021/ie50448a022 . [all data]