2-Octanol, acetate

Normal alkane RI, polar column, temperature ramp

Data compiled by: NIST Mass Spectrometry Data Center, William E. Wallace, director

Column type Capillary
Active phase HP-Wax
Column length (m) 30.
Carrier gas N2
Substrate
Column diameter (mm) 0.25
Phase thickness (μm) 0.25
Tstart (C) 50.
Tend (C) 250.
Heat rate (K/min) 5.
Initial hold (min)
Final hold (min) 10.
I 1497.
ReferenceFredj, Marzouk, et al., 2007
Comment MSDC-RI

References

Fredj, Marzouk, et al., 2007
Fredj, M.B.H.; Marzouk, B.; Chraief, I.; Boukef, K.; Marzouk, Z., Analysis of Tunisian Ruta graveolens L. oils from Jemmel, Journal of Food, Agriculture Environment, 2007, 5, 1, 52-55. [all data]