Disulfide, bis(3-methylbutyl)
- Formula: C10H22S2
- Molecular weight: 206.412
- IUPAC Standard InChIKey: MPYGLNNTOXLWOB-UHFFFAOYSA-N
- CAS Registry Number: 2051-04-9
- Chemical structure:

Phase change data

Data compiled by: Robert L. Brown and Stephen E. Stein
Quantity | Value | Units | Method | Reference | Comment |
---|---|---|---|---|---|
Tboil | 523.2 | K | N/A | Weast and Grasselli, 1989 |

Kovats' RI, non-polar column, isothermal

Column type | Active phase | Temperature (C) | I | Reference | Comment |
---|---|---|---|---|---|
Packed | Apiezon M | 130. | 1409. | Garbuzov, Misharina, et al., 1985 | He or N2, Chromosorb W, AW-DMCS; Column length: 2.1 m |

Normal alkane RI, non-polar column, custom temperature program

Column type | Active phase | I | Reference | Comment |
---|---|---|---|---|
Capillary | Apieson M | 1409. | Gao, Wang, et al., 2003 | Program: not specified |

Normal alkane RI, polar column, custom temperature program

Column type | Active phase | I | Reference | Comment |
---|---|---|---|---|
Capillary | PEG-1000 | 1669. | Gao, Wang, et al., 2003 | Program: not specified |

References

Weast and Grasselli, 1989
CRC Handbook of Data on Organic Compounds, 2nd Editon, Weast,R.C and Grasselli, J.G., ed(s)., CRC Press, Inc., Boca Raton, FL, 1989, 1. [all data]
Garbuzov, Misharina, et al., 1985
Garbuzov, V.G.; Misharina, T.A.; Aerov, A.F.; Golovnya, R.V.,
Gas chromatographic retention indices for sulphur(II)-containing organic substances,
J. Anal. Chem. USSR (Engl. Transl.), 1985, 40, 4, 576-586. [all data]
Gao, Wang, et al., 2003
Gao, Y.; Wang, Y.; Yao, X.; Zhang, X.; Liu, M.; Hu, Z.; Fan, B.,
The prediction for gas chromatographic retention index of disulfides on stationary phases of different polarity,
Talanta, 2003, 59, 2, 229-237, https://doi.org/10.1016/S0039-9140(02)00500-3
. [all data]