OIO anion

Gas phase ion energetics data

Data compiled by: John E. Bartmess

Electron affinity of neutral species

EAneutral (eV) Method Reference Comment
2.575 ± 0.010LPESWen, Hou, et al., 2011at 12K. Vertical Detachment Energy: 2.76±0.01 eV
2.5770 ± 0.0080LPESGilles, Polak, et al., 1992

References

Wen, Hou, et al., 2011
Wen, H.; Hou, G.L.; Huang, W.; Govind, N.; Wang, X.B., Photoelectron spectroscopy of higher bromine and iodine oxide anions: Electron affinities and electronic structures of BrO(2,3) and IO(2-4) radicals, J. Chem. Phys., 2011, 135, 18, 184309, https://doi.org/10.1063/1.3658858 . [all data]

Gilles, Polak, et al., 1992
Gilles, M.K.; Polak, M.L.; Lineberger, W.C., Photoelectron Spectroscopy of the Halogen Oxide Anions FO-, ClO-, BrO-, IO-, OClO-, and OIO-, J. Chem. Phys., 1992, 96, 11, 8012, https://doi.org/10.1063/1.462352 . [all data]