Prop-1-ene-2-yl phosphine

Gas phase ion energetics data

Data compiled by: Sharon G. Lias and Joel F. Liebman

Ionization energy determinations

IE (eV) Method Reference Comment
9.50PEGonbeau, Lacombe, et al., 1988Vertical value

References

Gonbeau, Lacombe, et al., 1988
Gonbeau, D.; Lacombe, S.; Lasnes, M.; Ripoll, J.; Pfister-Guillouzo, G., Ethenylphosphine. Synthesis by flash-vacuum thermolysis and characterization by photoelectron spectroscopy, J. Am. Chem. Soc., 1988, 110, 2730. [all data]