(5R,6R)-3,6-Dimethyl-5-(prop-1-en-2-yl)-6-vinyl-6,7-dihydrobenzofuran-4(5H)-one

Normal alkane RI, non-polar column, temperature ramp

Data compiled by: NIST Mass Spectrometry Data Center, William E. Wallace, director

Column type CapillaryCapillaryCapillary
Active phase Polydimethyl siloxane with 5 % PhDB-1DB-5MS
Column length (m) 30.30.30.
Carrier gas HeliumHeHe
Substrate
Column diameter (mm)  0.250.25
Phase thickness (μm)  0.250.25
Tstart (C) 80.60.60.
Tend (C) 200.250.280.
Heat rate (K/min) 5.5.3.
Initial hold (min)  5.30.
Final hold (min) 25.15.
I 1590.1610.1568.
ReferencePriya, Prathapan, et al., 2012Facundo, Pinto, et al., 2005Marongiu, Piras, et al., 2005
Comment MSDC-RI MSDC-RI MSDC-RI

References

Priya, Prathapan, et al., 2012
Priya, R.; Prathapan, A.; Raghu, K.G.; Menon, A.N., Chemical composition and in vitro antioxidative potential of essential oil isolated from Curcuma longa L. leaves, Asian Pacific Journal of Tropical Biomedicine, 2012, 2, 2, s695-s699, https://doi.org/10.1016/S2221-1691(12)60298-6 . [all data]

Facundo, Pinto, et al., 2005
Facundo, V.A.; Pinto, A.C.; Rezende, C.M., Aroma compounds and volatile chemical composition of Ruellia menthoides (Nees) Hiern, Flavour Fragr. J., 2005, 20, 1, 93-95, https://doi.org/10.1002/ffj.1380 . [all data]

Marongiu, Piras, et al., 2005
Marongiu, B.; Piras, A.; Porcedda, S.; Scorciapino, A., Chemical composition of the essential oil and supercritical CO2 extract of Commiphora myrrha (Nees) Engl. and of Acorus calamus L., J. Agric. Food Chem., 2005, 53, 20, 7939-7943, https://doi.org/10.1021/jf051100x . [all data]